{"text_format":"3","workbook":"xlsx","n_sheets":4,"sheets":["Analysis","2 Family Amortization Schedule","1 Family Amortization Schedule","Sheet1"],"read":"whole","date_system":"1900"}

{"sheet":"Analysis","index":0,"n_rows":68,"n_cols":12,"rows_kept":68,"merged":[[0,0,0,13],[2,0,2,12],[12,6,15,11],[24,10,24,12],[25,1,25,2],[25,4,25,5],[25,7,25,8],[25,10,25,12],[26,10,26,12],[33,1,33,2],[33,7,35,9],[35,1,35,2]]}
["TheMortgageGeek.com"]
[]
["1 Family : Multi Family Cash Flow / Equity Comparison"]
[]
[]
[null,null,"2 - 4 Family Home",null,"1 Family Home"]
[{"$nulls":6},"Notes:"]
[null,"Purchase",{"v":1250000,"d":"$1,250,000"},null,{"v":650000,"d":"$650,000"}]
[null,"Loan",{"$f":"C8-C11","v":{"v":1125000,"d":"$1,125,000"}},null,{"$f":"E8-E11","v":{"v":520000,"d":"$520,000"}},null,"•","The time value of money is not considered"]
[null,"Down Pmt %",{"v":0.1,"d":"10%"},null,{"v":0.2,"d":"20%"},null,"•","Tax Implications are not considered"]
[null,"Down Pmt",{"$f":"C8*C10","v":{"v":125000,"d":"$125,000"}},null,{"$f":"E8*E10","v":{"v":130000,"d":"$130,000"}},null,"•","The difference in closing costs is not considered"]
[]
[null,"Interest Rate",{"v":0.045,"d":"4.50%"},null,{"v":0.0425,"d":"4.25%"},null,"There are many variables and assumptions. This calculator is not designed to give an exact answer (we can't do that).\nHowever, we do feel that it does give you a compelling analysis with relevant data to help you make an informed decision.\n"]
[null,"Mortgage Payment",{"$f":"-PMT(C13/12,360,C9)","v":{"v":5700.209735541158,"d":"$5,700"}},null,{"$f":"-PMT(E13/12,360,E9)","v":{"v":2558.087433613315,"d":"$2,558"}}]
[null,"RE Tax",{"v":200,"d":"$200"},null,{"v":110,"d":"$110"}]
[null,"Insurance",{"v":125,"d":"$125"},null,{"v":100,"d":"$100"}]
[null,"Total Payment",{"$f":"C14+C15+C16","v":{"v":6025.209735541158,"d":"$6,025"}},null,{"$f":"E14+E15+E16","v":{"v":2768.087433613315,"d":"$2,768"}}]
[]
[null,"Rent ",{"v":2450,"d":"$2,450"}]
[]
[null,"Net Payment",{"$f":"C17-C19","v":{"v":3575.209735541158,"d":"$3,575"}},null,{"$f":"E17","v":{"v":2768.087433613315,"d":"$2,768"}}]
[null,"Difference",{"$f":"C21-E21","v":{"v":807.1223019278427,"d":"$807"}}]
[]
[]
[{"$nulls":10},"Difference in"]
[null,"Value after Year x",null,null,"Loan Balance After Year x",null,null,"Additional Home Equity after Year x*",null,null,"Additional Home Equity"]
["Year",{"$f":"C6","v":"2 - 4 Family Home"},{"$f":"E6","v":"1 Family Home"},null,{"$f":"B27","v":"2 - 4 Family Home"},{"$f":"C27","v":"1 Family Home"},null,{"$f":"B27","v":"2 - 4 Family Home"},{"$f":"C27","v":"1 Family Home"},null,"after Year x"]
[5,{"$f":"VLOOKUP(A28,$A$39:$C$68,2)","v":{"v":1595351.953125,"d":"$1,595,352"}},{"$f":"VLOOKUP(A28,$A$39:$C$68,3)","v":{"v":829583.015625,"d":"$829,583"}},null,{"$f":"VLOOKUP(A28,'2 Family Amortization Schedule'!$A$7:$G$366,7)","v":{"v":1025526.5680842369,"d":"$1,025,527"}},{"$f":"VLOOKUP(A28,'1 Family Amortization Schedule'!$A$7:$G$366,7)","v":{"v":472200.0222954832,"d":"$472,200"}},null,{"$f":"(B28-E28)-C$11","v":{"v":444825.38504076307,"d":"$444,825"}},{"$f":"(C28-F28)-E$11","v":{"v":227382.9933295168,"d":"$227,383"}},null,null,{"$f":"H28-I28","v":{"v":217442.39171124628,"d":"$217,442"}}]
[10,{"$f":"VLOOKUP(A29,$A$39:$C$68,2)","v":{"v":2036118.2834718022,"d":"$2,036,118"}},{"$f":"VLOOKUP(A29,$A$39:$C$68,3)","v":{"v":1058781.5074053374,"d":"$1,058,782"}},null,{"$f":"VLOOKUP(A29,'2 Family Amortization Schedule'!$A$7:$G$366,7)","v":{"v":901006.1417588887,"d":"$901,006"}},{"$f":"VLOOKUP(A29,'1 Family Amortization Schedule'!$A$7:$G$366,7)","v":{"v":413104.81908783416,"d":"$413,105"}},null,{"$f":"(B29-E29)-C$11","v":{"v":1010112.1417129135,"d":"$1,010,112"}},{"$f":"(C29-F29)-E$11","v":{"v":515676.6883175033,"d":"$515,677"}},null,null,{"$f":"H29-I29","v":{"v":494435.4533954102,"d":"$494,435"}}]
[15,{"$f":"VLOOKUP(A30,$A$39:$C$68,2)","v":{"v":2598660.22426421,"d":"$2,598,660"}},{"$f":"VLOOKUP(A30,$A$39:$C$68,3)","v":{"v":1351303.31661739,"d":"$1,351,303"}},null,{"$f":"VLOOKUP(A30,'2 Family Amortization Schedule'!$A$7:$G$366,7)","v":{"v":745131.9925149293,"d":"$745,132"}},{"$f":"VLOOKUP(A30,'1 Family Amortization Schedule'!$A$7:$G$366,7)","v":{"v":340045.3071411717,"d":"$340,045"}},null,{"v":1728528.2317492808,"d":"$1,728,528"},{"v":881258.0094762181,"d":"$881,258"},null,null,{"$f":"H30-I30","v":{"v":847270.2222730627,"d":"$847,270"}}]
[20,{"$f":"VLOOKUP(A31,$A$39:$C$68,2)","v":{"v":3316622.131430527,"d":"$3,316,622"}},{"$f":"VLOOKUP(A31,$A$39:$C$68,3)","v":{"v":1724643.508343875,"d":"$1,724,644"}},null,{"$f":"VLOOKUP(A31,'2 Family Amortization Schedule'!$A$7:$G$366,7)","v":{"v":550009.3839635794,"d":"$550,009"}},{"$f":"VLOOKUP(A31,'1 Family Amortization Schedule'!$A$7:$G$366,7)","v":{"v":249721.69378242092,"d":"$249,722"}},null,{"v":2641612.747466948,"d":"$2,641,613"},{"v":1344921.814561454,"d":"$1,344,922"},null,null,{"$f":"H31-I31","v":{"v":1296690.9329054938,"d":"$1,296,691"}}]
[30,{"$f":"VLOOKUP(A32,$A$39:$C$68,2)","v":{"v":5402427.968938333,"d":"$5,402,428"}},{"$f":"VLOOKUP(A32,$A$39:$C$68,3)","v":{"v":2809262.543847935,"d":"$2,809,263"}},null,{"$f":"VLOOKUP(A32,'2 Family Amortization Schedule'!$A$7:$G$366,7)","v":{"v":2.874003257602453e-10,"d":"$0"}},{"$f":"VLOOKUP(A32,'1 Family Amortization Schedule'!$A$7:$G$366,7)","v":{"v":1.1641532182693481E-10,"d":"$0"}},null,{"v":5277427.968938333,"d":"$5,277,428"},{"v":2679262.543847935,"d":"$2,679,263"},null,null,{"$f":"H32-I32","v":{"v":2598165.425090398,"d":"$2,598,165"}}]
[]
[null,"Assumed appreciation",{"$nulls":5},"* Additional Home Equity is the Actual Home Equity at a given time minus the Down Payment."]
[null,{"v":0.05,"d":"5%"},{"$f":"B35","v":{"v":0.05,"d":"5%"}}]
[null,"Value after Year x"]
[null,{"$f":"B27","v":"2 - 4 Family Home"},{"$f":"C27","v":"1 Family Home"}]
[0,{"$f":"C8","v":{"v":1250000,"d":"$1,250,000"}},{"$f":"E8","v":{"v":650000,"d":"$650,000"}}]
[1,{"$f":"B38*(1+$B$35)","v":{"v":1312500,"d":"$1,312,500"}},{"$f":"C38*(1+$C$35)","v":{"v":682500,"d":"$682,500"}}]
[2,{"v":1378125,"d":"$1,378,125"},{"v":716625,"d":"$716,625"}]
{"$rows_left_out":29}
{"sheet":"2 Family Amortization Schedule","index":1,"n_rows":366,"n_cols":7,"rows_kept":366,"merged":[[0,0,0,6],[1,0,1,6]]}
[{"$f":"Analysis!C6","v":"2 - 4 Family Home"}]
["Amortization Schedule"]
[]
[null,null,"Beginning",{"$nulls":3},"Ending"]
[null,null,"Principal","Monthly",null,null,"Principal"]
["Year","Month","Balance","Payment","Interest","Principal","Balance"]
[null,1,{"$f":"Analysis!C9","v":{"v":1125000,"d":"$1,125,000"}},{"$f":"Analysis!$C$14","v":{"v":5700.209735541158,"d":"$5,700"}},{"$f":"C7*Analysis!$C$13/12","v":{"v":4218.75,"d":"$4,219"}},{"$f":"D7-E7","v":{"v":1481.459735541158,"d":"$1,481"}},{"$f":"C7-F7","v":{"v":1123518.5402644589,"d":"$1,123,519"}}]
[null,2,{"$f":"G7","v":{"v":1123518.5402644589,"d":"$1,123,519"}},{"$f":"Analysis!$C$14","v":{"v":5700.209735541158,"d":"$5,700"}},{"$f":"C8*Analysis!$C$13/12","v":{"v":4213.19452599172,"d":"$4,213"}},{"v":1487.0152095494377,"d":"$1,487"},{"v":1122031.5250549095,"d":"$1,122,032"}]
[null,3,{"v":1122031.5250549095,"d":"$1,122,032"},{"$f":"Analysis!$C$14","v":{"v":5700.209735541158,"d":"$5,700"}},{"$f":"C9*Analysis!$C$13/12","v":{"v":4207.61821895591,"d":"$4,208"}},{"v":1492.5915165852475,"d":"$1,493"},{"v":1120538.9335383242,"d":"$1,120,539"}]
[null,4,{"v":1120538.9335383242,"d":"$1,120,539"},{"$f":"Analysis!$C$14","v":{"v":5700.209735541158,"d":"$5,700"}},{"$f":"C10*Analysis!$C$13/12","v":{"v":4202.021000768716,"d":"$4,202"}},{"v":1498.1887347724423,"d":"$1,498"},{"v":1119040.7448035518,"d":"$1,119,041"}]
[null,5,{"v":1119040.7448035518,"d":"$1,119,041"},{"$f":"Analysis!$C$14","v":{"v":5700.209735541158,"d":"$5,700"}},{"$f":"C11*Analysis!$C$13/12","v":{"v":4196.402793013319,"d":"$4,196"}},{"v":1503.806942527839,"d":"$1,504"},{"v":1117536.937861024,"d":"$1,117,537"}]
[null,6,{"v":1117536.937861024,"d":"$1,117,537"},{"$f":"Analysis!$C$14","v":{"v":5700.209735541158,"d":"$5,700"}},{"$f":"C12*Analysis!$C$13/12","v":{"v":4190.76351697884,"d":"$4,191"}},{"v":1509.4462185623179,"d":"$1,509"},{"v":1116027.4916424616,"d":"$1,116,027"}]
[null,7,{"v":1116027.4916424616,"d":"$1,116,027"},{"$f":"Analysis!$C$14","v":{"v":5700.209735541158,"d":"$5,700"}},{"$f":"C13*Analysis!$C$13/12","v":{"v":4185.1030936592315,"d":"$4,185"}},{"v":1515.1066418819264,"d":"$1,515"},{"v":1114512.3850005798,"d":"$1,114,512"}]
[null,8,{"v":1114512.3850005798,"d":"$1,114,512"},{"$f":"Analysis!$C$14","v":{"v":5700.209735541158,"d":"$5,700"}},{"$f":"C14*Analysis!$C$13/12","v":{"v":4179.421443752174,"d":"$4,179"}},{"v":1520.7882917889838,"d":"$1,521"},{"v":1112991.5967087909,"d":"$1,112,992"}]
[null,9,{"v":1112991.5967087909,"d":"$1,112,992"},{"$f":"Analysis!$C$14","v":{"v":5700.209735541158,"d":"$5,700"}},{"$f":"C15*Analysis!$C$13/12","v":{"v":4173.718487657966,"d":"$4,174"}},{"v":1526.491247883192,"d":"$1,526"},{"v":1111465.1054609076,"d":"$1,111,465"}]
[null,10,{"v":1111465.1054609076,"d":"$1,111,465"},{"$f":"Analysis!$C$14","v":{"v":5700.209735541158,"d":"$5,700"}},{"$f":"C16*Analysis!$C$13/12","v":{"v":4167.994145478403,"d":"$4,168"}},{"v":1532.215590062755,"d":"$1,532"},{"v":1109932.8898708448,"d":"$1,109,933"}]
[null,11,{"v":1109932.8898708448,"d":"$1,109,933"},{"$f":"Analysis!$C$14","v":{"v":5700.209735541158,"d":"$5,700"}},{"$f":"C17*Analysis!$C$13/12","v":{"v":4162.248337015668,"d":"$4,162"}},{"v":1537.96139852549,"d":"$1,538"},{"v":1108394.9284723194,"d":"$1,108,395"}]
[1,12,{"v":1108394.9284723194,"d":"$1,108,395"},{"$f":"Analysis!$C$14","v":{"v":5700.209735541158,"d":"$5,700"}},{"$f":"C18*Analysis!$C$13/12","v":{"v":4156.480981771198,"d":"$4,156"}},{"v":1543.7287537699603,"d":"$1,544"},{"v":1106851.1997185494,"d":"$1,106,851"}]
[null,13,{"v":1106851.1997185494,"d":"$1,106,851"},{"$f":"Analysis!$C$14","v":{"v":5700.209735541158,"d":"$5,700"}},{"$f":"C19*Analysis!$C$13/12","v":{"v":4150.6919989445605,"d":"$4,151"}},{"v":1549.5177365965974,"d":"$1,550"},{"v":1105301.6819819529,"d":"$1,105,302"}]
[null,14,{"v":1105301.6819819529,"d":"$1,105,302"},{"$f":"Analysis!$C$14","v":{"v":5700.209735541158,"d":"$5,700"}},{"$f":"C20*Analysis!$C$13/12","v":{"v":4144.881307432323,"d":"$4,145"}},{"v":1555.3284281088345,"d":"$1,555"},{"v":1103746.353553844,"d":"$1,103,746"}]
[null,15,{"v":1103746.353553844,"d":"$1,103,746"},{"$f":"Analysis!$C$14","v":{"v":5700.209735541158,"d":"$5,700"}},{"$f":"C21*Analysis!$C$13/12","v":{"v":4139.048825826914,"d":"$4,139"}},{"v":1561.1609097142436,"d":"$1,561"},{"v":1102185.1926441297,"d":"$1,102,185"}]
[null,16,{"v":1102185.1926441297,"d":"$1,102,185"},{"$f":"Analysis!$C$14","v":{"v":5700.209735541158,"d":"$5,700"}},{"$f":"C22*Analysis!$C$13/12","v":{"v":4133.194472415486,"d":"$4,133"}},{"v":1567.0152631256715,"d":"$1,567"},{"v":1100618.177381004,"d":"$1,100,618"}]
[null,17,{"v":1100618.177381004,"d":"$1,100,618"},{"$f":"Analysis!$C$14","v":{"v":5700.209735541158,"d":"$5,700"}},{"$f":"C23*Analysis!$C$13/12","v":{"v":4127.3181651787645,"d":"$4,127"}},{"v":1572.8915703623934,"d":"$1,573"},{"v":1099045.2858106415,"d":"$1,099,045"}]
[null,18,{"v":1099045.2858106415,"d":"$1,099,045"},{"$f":"Analysis!$C$14","v":{"v":5700.209735541158,"d":"$5,700"}},{"$f":"C24*Analysis!$C$13/12","v":{"v":4121.419821789906,"d":"$4,121"}},{"v":1578.7899137512522,"d":"$1,579"},{"v":1097466.4958968903,"d":"$1,097,466"}]
[null,19,{"v":1097466.4958968903,"d":"$1,097,466"},{"$f":"Analysis!$C$14","v":{"v":5700.209735541158,"d":"$5,700"}},{"$f":"C25*Analysis!$C$13/12","v":{"v":4115.499359613338,"d":"$4,115"}},{"v":1584.7103759278198,"d":"$1,585"},{"v":1095881.7855209624,"d":"$1,095,882"}]
[null,20,{"v":1095881.7855209624,"d":"$1,095,882"},{"$f":"Analysis!$C$14","v":{"v":5700.209735541158,"d":"$5,700"}},{"$f":"C26*Analysis!$C$13/12","v":{"v":4109.556695703609,"d":"$4,110"}},{"v":1590.653039837549,"d":"$1,591"},{"v":1094291.132481125,"d":"$1,094,291"}]
[null,21,{"v":1094291.132481125,"d":"$1,094,291"},{"$f":"Analysis!$C$14","v":{"v":5700.209735541158,"d":"$5,700"}},{"$f":"C27*Analysis!$C$13/12","v":{"v":4103.591746804218,"d":"$4,104"}},{"v":1596.6179887369399,"d":"$1,597"},{"v":1092694.514492388,"d":"$1,092,695"}]
[null,22,{"v":1092694.514492388,"d":"$1,092,695"},{"$f":"Analysis!$C$14","v":{"v":5700.209735541158,"d":"$5,700"}},{"$f":"C28*Analysis!$C$13/12","v":{"v":4097.604429346456,"d":"$4,098"}},{"v":1602.6053061947023,"d":"$1,603"},{"v":1091091.9091861935,"d":"$1,091,092"}]
[null,23,{"v":1091091.9091861935,"d":"$1,091,092"},{"$f":"Analysis!$C$14","v":{"v":5700.209735541158,"d":"$5,700"}},{"$f":"C29*Analysis!$C$13/12","v":{"v":4091.5946594482252,"d":"$4,092"}},{"v":1608.6150760929327,"d":"$1,609"},{"v":1089483.2941101005,"d":"$1,089,483"}]
[2,24,{"v":1089483.2941101005,"d":"$1,089,483"},{"$f":"Analysis!$C$14","v":{"v":5700.209735541158,"d":"$5,700"}},{"$f":"C30*Analysis!$C$13/12","v":{"v":4085.5623529128766,"d":"$4,086"}},{"v":1614.6473826282813,"d":"$1,615"},{"v":1087868.6467274723,"d":"$1,087,869"}]
[null,25,{"v":1087868.6467274723,"d":"$1,087,869"},{"$f":"Analysis!$C$14","v":{"v":5700.209735541158,"d":"$5,700"}},{"$f":"C31*Analysis!$C$13/12","v":{"v":4079.507425228021,"d":"$4,080"}},{"v":1620.7023103131369,"d":"$1,621"},{"v":1086247.944417159,"d":"$1,086,248"}]
[null,26,{"v":1086247.944417159,"d":"$1,086,248"},{"$f":"Analysis!$C$14","v":{"v":5700.209735541158,"d":"$5,700"}},{"$f":"C32*Analysis!$C$13/12","v":{"v":4073.429791564346,"d":"$4,073"}},{"v":1626.7799439768119,"d":"$1,627"},{"v":1084621.1644731823,"d":"$1,084,621"}]
[null,27,{"v":1084621.1644731823,"d":"$1,084,621"},{"$f":"Analysis!$C$14","v":{"v":5700.209735541158,"d":"$5,700"}},{"$f":"C33*Analysis!$C$13/12","v":{"v":4067.3293667744333,"d":"$4,067"}},{"v":1632.8803687667246,"d":"$1,633"},{"v":1082988.2841044154,"d":"$1,082,988"}]
[null,28,{"v":1082988.2841044154,"d":"$1,082,988"},{"$f":"Analysis!$C$14","v":{"v":5700.209735541158,"d":"$5,700"}},{"$f":"C34*Analysis!$C$13/12","v":{"v":4061.206065391558,"d":"$4,061"}},{"v":1639.0036701496,"d":"$1,639"},{"v":1081349.2804342657,"d":"$1,081,349"}]
[null,29,{"v":1081349.2804342657,"d":"$1,081,349"},{"$f":"Analysis!$C$14","v":{"v":5700.209735541158,"d":"$5,700"}},{"$f":"C35*Analysis!$C$13/12","v":{"v":4055.0598016284966,"d":"$4,055"}},{"v":1645.1499339126613,"d":"$1,645"},{"v":1079704.1305003532,"d":"$1,079,704"}]
[null,30,{"v":1079704.1305003532,"d":"$1,079,704"},{"$f":"Analysis!$C$14","v":{"v":5700.209735541158,"d":"$5,700"}},{"$f":"C36*Analysis!$C$13/12","v":{"v":4048.8904893763242,"d":"$4,049"}},{"v":1651.3192461648337,"d":"$1,651"},{"v":1078052.8112541884,"d":"$1,078,053"}]
[null,31,{"v":1078052.8112541884,"d":"$1,078,053"},{"$f":"Analysis!$C$14","v":{"v":5700.209735541158,"d":"$5,700"}},{"$f":"C37*Analysis!$C$13/12","v":{"v":4042.6980422032066,"d":"$4,043"}},{"v":1657.5116933379513,"d":"$1,658"},{"v":1076395.2995608505,"d":"$1,076,395"}]
[null,32,{"v":1076395.2995608505,"d":"$1,076,395"},{"$f":"Analysis!$C$14","v":{"v":5700.209735541158,"d":"$5,700"}},{"$f":"C38*Analysis!$C$13/12","v":{"v":4036.482373353189,"d":"$4,036"}},{"v":1663.727362187969,"d":"$1,664"},{"v":1074731.5721986624,"d":"$1,074,732"}]
[null,33,{"v":1074731.5721986624,"d":"$1,074,732"},{"$f":"Analysis!$C$14","v":{"v":5700.209735541158,"d":"$5,700"}},{"$f":"C39*Analysis!$C$13/12","v":{"v":4030.2433957449844,"d":"$4,030"}},{"v":1669.9663397961735,"d":"$1,670"},{"v":1073061.6058588664,"d":"$1,073,062"}]
[null,34,{"v":1073061.6058588664,"d":"$1,073,062"},{"$f":"Analysis!$C$14","v":{"v":5700.209735541158,"d":"$5,700"}},{"$f":"C40*Analysis!$C$13/12","v":{"v":4023.9810219707488,"d":"$4,024"}},{"v":1676.2287135704091,"d":"$1,676"},{"v":1071385.377145296,"d":"$1,071,385"}]
{"$rows_left_out":327}
{"sheet":"1 Family Amortization Schedule","index":2,"n_rows":366,"n_cols":7,"rows_kept":366,"merged":[[0,0,0,6],[1,0,1,6]]}
[{"$f":"Analysis!E6","v":"1 Family Home"}]
["Amortization Schedule"]
[]
[null,null,"Beginning",{"$nulls":3},"Ending"]
[null,null,"Principal","Monthly",null,null,"Principal"]
["Year","Month","Balance","Payment","Interest","Principal","Balance"]
[null,1,{"$f":"Analysis!E9","v":{"v":520000,"d":"$520,000"}},{"$f":"Analysis!$E$14","v":{"v":2558.087433613315,"d":"$2,558"}},{"$f":"C7*Analysis!$E$13/12","v":{"v":1841.6666666666667,"d":"$1,842"}},{"$f":"D7-E7","v":{"v":716.4207669466484,"d":"$716"}},{"$f":"C7-F7","v":{"v":519283.5792330534,"d":"$519,284"}}]
[null,2,{"$f":"G7","v":{"v":519283.5792330534,"d":"$519,284"}},{"$f":"Analysis!$E$14","v":{"v":2558.087433613315,"d":"$2,558"}},{"$f":"C8*Analysis!$E$13/12","v":{"v":1839.1293431170643,"d":"$1,839"}},{"v":718.9580904962509,"d":"$719"},{"v":518564.6211425571,"d":"$518,565"}]
[null,3,{"v":518564.6211425571,"d":"$518,565"},{"$f":"Analysis!$E$14","v":{"v":2558.087433613315,"d":"$2,558"}},{"$f":"C9*Analysis!$E$13/12","v":{"v":1836.5830332132234,"d":"$1,837"}},{"v":721.5044004000918,"d":"$722"},{"v":517843.116742157,"d":"$517,843"}]
[null,4,{"v":517843.116742157,"d":"$517,843"},{"$f":"Analysis!$E$14","v":{"v":2558.087433613315,"d":"$2,558"}},{"$f":"C10*Analysis!$E$13/12","v":{"v":1834.027705128473,"d":"$1,834"}},{"v":724.0597284848423,"d":"$724"},{"v":517119.0570136722,"d":"$517,119"}]
[null,5,{"v":517119.0570136722,"d":"$517,119"},{"$f":"Analysis!$E$14","v":{"v":2558.087433613315,"d":"$2,558"}},{"$f":"C11*Analysis!$E$13/12","v":{"v":1831.4633269234225,"d":"$1,831"}},{"v":726.6241066898926,"d":"$727"},{"v":516392.4329069823,"d":"$516,392"}]
[null,6,{"v":516392.4329069823,"d":"$516,392"},{"$f":"Analysis!$E$14","v":{"v":2558.087433613315,"d":"$2,558"}},{"$f":"C12*Analysis!$E$13/12","v":{"v":1828.8898665455624,"d":"$1,829"}},{"v":729.1975670677527,"d":"$729"},{"v":515663.23533991456,"d":"$515,663"}]
[null,7,{"v":515663.23533991456,"d":"$515,663"},{"$f":"Analysis!$E$14","v":{"v":2558.087433613315,"d":"$2,558"}},{"$f":"C13*Analysis!$E$13/12","v":{"v":1826.3072918288642,"d":"$1,826"}},{"v":731.780141784451,"d":"$732"},{"v":514931.4551981301,"d":"$514,931"}]
[null,8,{"v":514931.4551981301,"d":"$514,931"},{"$f":"Analysis!$E$14","v":{"v":2558.087433613315,"d":"$2,558"}},{"$f":"C14*Analysis!$E$13/12","v":{"v":1823.7155704933775,"d":"$1,824"}},{"v":734.3718631199376,"d":"$734"},{"v":514197.08333501016,"d":"$514,197"}]
[null,9,{"v":514197.08333501016,"d":"$514,197"},{"$f":"Analysis!$E$14","v":{"v":2558.087433613315,"d":"$2,558"}},{"$f":"C15*Analysis!$E$13/12","v":{"v":1821.1146701448279,"d":"$1,821"}},{"v":736.9727634684873,"d":"$737"},{"v":513460.11057154165,"d":"$513,460"}]
[null,10,{"v":513460.11057154165,"d":"$513,460"},{"$f":"Analysis!$E$14","v":{"v":2558.087433613315,"d":"$2,558"}},{"$f":"C16*Analysis!$E$13/12","v":{"v":1818.5045582742102,"d":"$1,819"}},{"v":739.5828753391049,"d":"$740"},{"v":512720.52769620257,"d":"$512,721"}]
[null,11,{"v":512720.52769620257,"d":"$512,721"},{"$f":"Analysis!$E$14","v":{"v":2558.087433613315,"d":"$2,558"}},{"$f":"C17*Analysis!$E$13/12","v":{"v":1815.8852022573844,"d":"$1,816"}},{"v":742.2022313559307,"d":"$742"},{"v":511978.3254648466,"d":"$511,978"}]
[1,12,{"v":511978.3254648466,"d":"$511,978"},{"$f":"Analysis!$E$14","v":{"v":2558.087433613315,"d":"$2,558"}},{"$f":"C18*Analysis!$E$13/12","v":{"v":1813.256569354665,"d":"$1,813"}},{"v":744.8308642586501,"d":"$745"},{"v":511233.494600588,"d":"$511,233"}]
[null,13,{"v":511233.494600588,"d":"$511,233"},{"$f":"Analysis!$E$14","v":{"v":2558.087433613315,"d":"$2,558"}},{"$f":"C19*Analysis!$E$13/12","v":{"v":1810.6186267104158,"d":"$1,811"}},{"v":747.4688069028994,"d":"$747"},{"v":510486.0257936851,"d":"$510,486"}]
[null,14,{"v":510486.0257936851,"d":"$510,486"},{"$f":"Analysis!$E$14","v":{"v":2558.087433613315,"d":"$2,558"}},{"$f":"C20*Analysis!$E$13/12","v":{"v":1807.971341352635,"d":"$1,808"}},{"v":750.1160922606803,"d":"$750"},{"v":509735.9097014244,"d":"$509,736"}]
[null,15,{"v":509735.9097014244,"d":"$509,736"},{"$f":"Analysis!$E$14","v":{"v":2558.087433613315,"d":"$2,558"}},{"$f":"C21*Analysis!$E$13/12","v":{"v":1805.314680192545,"d":"$1,805"}},{"v":752.7727534207702,"d":"$753"},{"v":508983.13694800367,"d":"$508,983"}]
[null,16,{"v":508983.13694800367,"d":"$508,983"},{"$f":"Analysis!$E$14","v":{"v":2558.087433613315,"d":"$2,558"}},{"$f":"C22*Analysis!$E$13/12","v":{"v":1802.6486100241798,"d":"$1,803"}},{"v":755.4388235891354,"d":"$755"},{"v":508227.69812441454,"d":"$508,228"}]
[null,17,{"v":508227.69812441454,"d":"$508,228"},{"$f":"Analysis!$E$14","v":{"v":2558.087433613315,"d":"$2,558"}},{"$f":"C23*Analysis!$E$13/12","v":{"v":1799.9730975239684,"d":"$1,800"}},{"v":758.1143360893468,"d":"$758"},{"v":507469.5837883252,"d":"$507,470"}]
[null,18,{"v":507469.5837883252,"d":"$507,470"},{"$f":"Analysis!$E$14","v":{"v":2558.087433613315,"d":"$2,558"}},{"$f":"C24*Analysis!$E$13/12","v":{"v":1797.2881092503185,"d":"$1,797"}},{"v":760.7993243629967,"d":"$761"},{"v":506708.7844639622,"d":"$506,709"}]
[null,19,{"v":506708.7844639622,"d":"$506,709"},{"$f":"Analysis!$E$14","v":{"v":2558.087433613315,"d":"$2,558"}},{"$f":"C25*Analysis!$E$13/12","v":{"v":1794.5936116431994,"d":"$1,795"}},{"v":763.4938219701157,"d":"$763"},{"v":505945.29064199206,"d":"$505,945"}]
[null,20,{"v":505945.29064199206,"d":"$505,945"},{"$f":"Analysis!$E$14","v":{"v":2558.087433613315,"d":"$2,558"}},{"$f":"C26*Analysis!$E$13/12","v":{"v":1791.889571023722,"d":"$1,792"}},{"v":766.1978625895931,"d":"$766"},{"v":505179.09277940245,"d":"$505,179"}]
[null,21,{"v":505179.09277940245,"d":"$505,179"},{"$f":"Analysis!$E$14","v":{"v":2558.087433613315,"d":"$2,558"}},{"$f":"C27*Analysis!$E$13/12","v":{"v":1789.1759535937172,"d":"$1,789"}},{"v":768.911480019598,"d":"$769"},{"v":504410.1812993828,"d":"$504,410"}]
[null,22,{"v":504410.1812993828,"d":"$504,410"},{"$f":"Analysis!$E$14","v":{"v":2558.087433613315,"d":"$2,558"}},{"$f":"C28*Analysis!$E$13/12","v":{"v":1786.4527254353143,"d":"$1,786"}},{"v":771.6347081780009,"d":"$772"},{"v":503638.5465912048,"d":"$503,639"}]
[null,23,{"v":503638.5465912048,"d":"$503,639"},{"$f":"Analysis!$E$14","v":{"v":2558.087433613315,"d":"$2,558"}},{"$f":"C29*Analysis!$E$13/12","v":{"v":1783.719852510517,"d":"$1,784"}},{"v":774.3675811027981,"d":"$774"},{"v":502864.179010102,"d":"$502,864"}]
[2,24,{"v":502864.179010102,"d":"$502,864"},{"$f":"Analysis!$E$14","v":{"v":2558.087433613315,"d":"$2,558"}},{"$f":"C30*Analysis!$E$13/12","v":{"v":1780.9773006607782,"d":"$1,781"}},{"v":777.110132952537,"d":"$777"},{"v":502087.0688771495,"d":"$502,087"}]
[null,25,{"v":502087.0688771495,"d":"$502,087"},{"$f":"Analysis!$E$14","v":{"v":2558.087433613315,"d":"$2,558"}},{"$f":"C31*Analysis!$E$13/12","v":{"v":1778.2250356065713,"d":"$1,778"}},{"v":779.8623980067439,"d":"$780"},{"v":501307.20647914277,"d":"$501,307"}]
[null,26,{"v":501307.20647914277,"d":"$501,307"},{"$f":"Analysis!$E$14","v":{"v":2558.087433613315,"d":"$2,558"}},{"$f":"C32*Analysis!$E$13/12","v":{"v":1775.463022946964,"d":"$1,775"}},{"v":782.6244106663512,"d":"$783"},{"v":500524.5820684764,"d":"$500,525"}]
[null,27,{"v":500524.5820684764,"d":"$500,525"},{"$f":"Analysis!$E$14","v":{"v":2558.087433613315,"d":"$2,558"}},{"$f":"C33*Analysis!$E$13/12","v":{"v":1772.6912281591874,"d":"$1,773"}},{"v":785.3962054541278,"d":"$785"},{"v":499739.1858630223,"d":"$499,739"}]
[null,28,{"v":499739.1858630223,"d":"$499,739"},{"$f":"Analysis!$E$14","v":{"v":2558.087433613315,"d":"$2,558"}},{"$f":"C34*Analysis!$E$13/12","v":{"v":1769.909616598204,"d":"$1,770"}},{"v":788.1778170151113,"d":"$788"},{"v":498951.0080460072,"d":"$498,951"}]
[null,29,{"v":498951.0080460072,"d":"$498,951"},{"$f":"Analysis!$E$14","v":{"v":2558.087433613315,"d":"$2,558"}},{"$f":"C35*Analysis!$E$13/12","v":{"v":1767.1181534962755,"d":"$1,767"}},{"v":790.9692801170397,"d":"$791"},{"v":498160.0387658902,"d":"$498,160"}]
[null,30,{"v":498160.0387658902,"d":"$498,160"},{"$f":"Analysis!$E$14","v":{"v":2558.087433613315,"d":"$2,558"}},{"$f":"C36*Analysis!$E$13/12","v":{"v":1764.316803962528,"d":"$1,764"}},{"v":793.7706296507872,"d":"$794"},{"v":497366.2681362394,"d":"$497,366"}]
[null,31,{"v":497366.2681362394,"d":"$497,366"},{"$f":"Analysis!$E$14","v":{"v":2558.087433613315,"d":"$2,558"}},{"$f":"C37*Analysis!$E$13/12","v":{"v":1761.5055329825145,"d":"$1,762"}},{"v":796.5819006308006,"d":"$797"},{"v":496569.6862356086,"d":"$496,570"}]
[null,32,{"v":496569.6862356086,"d":"$496,570"},{"$f":"Analysis!$E$14","v":{"v":2558.087433613315,"d":"$2,558"}},{"$f":"C38*Analysis!$E$13/12","v":{"v":1758.6843054177805,"d":"$1,759"}},{"v":799.4031281955347,"d":"$799"},{"v":495770.28310741304,"d":"$495,770"}]
[null,33,{"v":495770.28310741304,"d":"$495,770"},{"$f":"Analysis!$E$14","v":{"v":2558.087433613315,"d":"$2,558"}},{"$f":"C39*Analysis!$E$13/12","v":{"v":1755.8530860054213,"d":"$1,756"}},{"v":802.2343476078938,"d":"$802"},{"v":494968.04875980515,"d":"$494,968"}]
[null,34,{"v":494968.04875980515,"d":"$494,968"},{"$f":"Analysis!$E$14","v":{"v":2558.087433613315,"d":"$2,558"}},{"$f":"C40*Analysis!$E$13/12","v":{"v":1753.0118393576433,"d":"$1,753"}},{"v":805.0755942556718,"d":"$805"},{"v":494162.97316554945,"d":"$494,163"}]
{"$rows_left_out":327}
{"sheet":"Sheet1","index":3,"n_rows":0,"n_cols":0,"rows_kept":0}