{"text_format":"3","workbook":"xlsx","n_sheets":5,"sheets":["Instructions","Example","Construction Budget","Budget Review","Reference"],"not_rendered":{"external_links":2,"defined_names":42},"read":"whole","date_system":"1900"}

{"sheet":"Instructions","index":0,"n_rows":0,"n_cols":0,"rows_kept":0}

{"sheet":"Example","index":1,"n_rows":177,"n_cols":10,"rows_kept":177,"merged":[[2,1,3,3],[6,1,8,2],[7,5,7,8],[9,1,9,2],[10,1,18,2],[10,5,11,5],[20,1,21,1],[20,2,21,3],[24,1,26,5],[26,8,26,9],[176,1,176,5]]}
[]
[]
[null,"Construction Budget Submission Form"]
[]
[]
[null,"Version","4.4"]
[null,"Step 1: Fill out a description of the entire construction project. "]
[{"$nulls":3},{"$f":"\"Status: \"&IF(RF_Status=\"\",\"\",RF_Status)","v":"Status: Initial Budget"}]
[]
[null,"Scope of Work:",null,"Start Date:","2019-01-01","Total Budget:"]
[null,"This property is located in the New York, NY area and will be a complete gut and flip. We will be putting in new drywall, hardwood flooring, tile in the kitchen, and carpet in the bedrooms. We will be putting in all new mid-grade fixtures in the bathroom. We will be painting the exterior of the property, putting in new fencing, and putting in new sod. ",null,"Estimated Completion Date:","2019-07-01",{"$f":"IFERROR(SUM(AMT_Totals)-SUM(AMT_CatSubtotals),\"$0 .00 \")","v":{"v":71292,"d":"$71,292.00"}}]
[{"$nulls":3},"Expected Draws:",5]
[]
[{"$nulls":4},"Current","Projected"]
[{"$nulls":3},"Total Square Feet:",2200,2200]
[{"$nulls":3},"Rooms/Units:",10,10]
[{"$nulls":3},"Bedrooms:",3,3]
[{"$nulls":3},"Bathrooms:",2,2]
[{"$nulls":3},"Kitchens:",1,1]
[]
[null,"Property Address:","123 Main St, New York, NY 10030"]
[]
[]
[]
[null,"Step 2: Fill in each line item with the description of the construction cost, the amount, the estimated date of completion, and the draw item name (if necessary)."]
[]
[{"$nulls":8},"Lima One Capital\nBudget Review"]
[null,"Item Number","Category / Draw Item","Description","Amount","Estimated Completion Date",null,null,"Recommended Budget  ","  Comments"]
[]
[null,null,"Soft Costs"]
[null,"Column1","Column2","Column3","Column4","Column5","Column6"]
[null,"1000-2","Temp Gas*","(Enter your description here)",null,null,{"$f":"IFERROR(IF(OR(Table162[[#This Row],[Column4]]=\"\",Table162[[#This Row],[Column4]]=0),\"\",ROUND(Table162[[#This Row],[Column4]],2)),\"\")","v":""},null,{"$f":"IF(AMT_Recommend1=\"\",\"\",AMT_Recommend1)","v":""},{"$f":"IF(FR_Comments=\"\",\"\",FR_Comments)","v":""}]
[null,"1000-3","Temp Power*",{"$nulls":3},{"$f":"IFERROR(IF(OR(Table162[[#This Row],[Column4]]=\"\",Table162[[#This Row],[Column4]]=0),\"\",ROUND(Table162[[#This Row],[Column4]],2)),\"\")","v":""},null,"",""]
[null,"1000-4","Temp Toilet",{"$nulls":3},{"$f":"IFERROR(IF(OR(Table162[[#This Row],[Column4]]=\"\",Table162[[#This Row],[Column4]]=0),\"\",ROUND(Table162[[#This Row],[Column4]],2)),\"\")","v":""},null,"",""]
[null,"1000-5","Architecutral Fees",{"$nulls":3},{"$f":"IFERROR(IF(OR(Table162[[#This Row],[Column4]]=\"\",Table162[[#This Row],[Column4]]=0),\"\",ROUND(Table162[[#This Row],[Column4]],2)),\"\")","v":""},null,"",""]
[null,"1000-6","Engineering Fees",{"$nulls":3},{"$f":"IFERROR(IF(OR(Table162[[#This Row],[Column4]]=\"\",Table162[[#This Row],[Column4]]=0),\"\",ROUND(Table162[[#This Row],[Column4]],2)),\"\")","v":""},null,"",""]
[null,"1000-7","Building Permit*","Plumbing, electrical, Framing, HVAC",{"v":1200,"d":"1,200.00"},"2019-09-01",{"$f":"IFERROR(IF(OR(Table162[[#This Row],[Column4]]=\"\",Table162[[#This Row],[Column4]]=0),\"\",ROUND(Table162[[#This Row],[Column4]],2)),\"\")","v":1200},null,"",""]
[null,"1000-8","Impact Fees",{"$nulls":3},{"$f":"IFERROR(IF(OR(Table162[[#This Row],[Column4]]=\"\",Table162[[#This Row],[Column4]]=0),\"\",ROUND(Table162[[#This Row],[Column4]],2)),\"\")","v":""},null,"",""]
[null,"1000-9","Survey",{"$nulls":3},{"$f":"IFERROR(IF(OR(Table162[[#This Row],[Column4]]=\"\",Table162[[#This Row],[Column4]]=0),\"\",ROUND(Table162[[#This Row],[Column4]],2)),\"\")","v":""},null,"",""]
[null,"1000-10","Survey/Drawings/Plans*",{"$nulls":3},{"$f":"IFERROR(IF(OR(Table162[[#This Row],[Column4]]=\"\",Table162[[#This Row],[Column4]]=0),\"\",ROUND(Table162[[#This Row],[Column4]],2)),\"\")","v":""},null,"",""]
[null,"1000-11","Erosion Fence",{"$nulls":3},{"$f":"IFERROR(IF(OR(Table162[[#This Row],[Column4]]=\"\",Table162[[#This Row],[Column4]]=0),\"\",ROUND(Table162[[#This Row],[Column4]],2)),\"\")","v":""},null,"",""]
[null,"1000-12","(Enter your line item here)",{"$nulls":3},{"$f":"IFERROR(IF(OR(Table162[[#This Row],[Column4]]=\"\",Table162[[#This Row],[Column4]]=0),\"\",ROUND(Table162[[#This Row],[Column4]],2)),\"\")","v":""},null,"",""]
[null,"1000-13","(Enter your line item here)",{"$nulls":3},{"$f":"IFERROR(IF(OR(Table162[[#This Row],[Column4]]=\"\",Table162[[#This Row],[Column4]]=0),\"\",ROUND(Table162[[#This Row],[Column4]],2)),\"\")","v":""},null,"",""]
[null,null,"Total Soft Costs",null,{"$f":"G44","v":{"v":1200,"d":"1,200.00"}},null,{"$f":"SUM(G32:G43)","v":{"v":1200,"d":"1,200.00"}},null,"",""]
[{"$nulls":8},"",""]
[null,null,"Demolition- Trashout",{"$nulls":5},"",""]
[null,"2000-1","Demolition*","Gut the entire home",{"v":2500,"d":"2,500.00"},"2019-09-18",{"$f":"IFERROR(IF(OR(Table162[[#This Row],[Column4]]=\"\",Table162[[#This Row],[Column4]]=0),\"\",ROUND(Table162[[#This Row],[Column4]],2)),\"\")","v":2500},null,"",""]
[null,"2000-2","Trashout",{"$nulls":3},{"$f":"IFERROR(IF(OR(Table162[[#This Row],[Column4]]=\"\",Table162[[#This Row],[Column4]]=0),\"\",ROUND(Table162[[#This Row],[Column4]],2)),\"\")","v":""},null,"",""]
[null,"2000-3","Dumpster","4 30 yard dumpsters ",{"v":2000,"d":"2,000.00"},"2019-09-15",{"$f":"IFERROR(IF(OR(Table162[[#This Row],[Column4]]=\"\",Table162[[#This Row],[Column4]]=0),\"\",ROUND(Table162[[#This Row],[Column4]],2)),\"\")","v":2000},null,"",""]
[null,"2000-4","(Enter your line item here)",{"$nulls":3},{"$f":"IFERROR(IF(OR(Table162[[#This Row],[Column4]]=\"\",Table162[[#This Row],[Column4]]=0),\"\",ROUND(Table162[[#This Row],[Column4]],2)),\"\")","v":""},null,"",""]
[null,"2000-5","(Enter your line item here)",{"$nulls":3},{"$f":"IFERROR(IF(OR(Table162[[#This Row],[Column4]]=\"\",Table162[[#This Row],[Column4]]=0),\"\",ROUND(Table162[[#This Row],[Column4]],2)),\"\")","v":""},null,"",""]
[null,null,"Total Trashout",null,{"$f":"G52","v":{"v":4500,"d":"4,500.00"}},null,{"$f":"SUM(G47:G51)","v":{"v":4500,"d":"4,500.00"}},null,"",""]
[{"$nulls":8},"",""]
[null,null,"Site Work",{"$nulls":5},"",""]
[null,"3000-1","Grading*","(Enter your description here)",null,null,{"$f":"IFERROR(IF(OR(Table162[[#This Row],[Column4]]=\"\",Table162[[#This Row],[Column4]]=0),\"\",ROUND(Table162[[#This Row],[Column4]],2)),\"\")","v":""},null,"",""]
[null,"3000-2","Underground *",{"$nulls":3},{"$f":"IFERROR(IF(OR(Table162[[#This Row],[Column4]]=\"\",Table162[[#This Row],[Column4]]=0),\"\",ROUND(Table162[[#This Row],[Column4]],2)),\"\")","v":""},null,"",""]
[null,"3000-3","Conduit",{"$nulls":3},{"$f":"IFERROR(IF(OR(Table162[[#This Row],[Column4]]=\"\",Table162[[#This Row],[Column4]]=0),\"\",ROUND(Table162[[#This Row],[Column4]],2)),\"\")","v":""},null,"",""]
[null,"3000-4","Water Lines*","Replacing water lines",{"v":3750,"d":"3,750.00"},"2019-11-01",{"$f":"IFERROR(IF(OR(Table162[[#This Row],[Column4]]=\"\",Table162[[#This Row],[Column4]]=0),\"\",ROUND(Table162[[#This Row],[Column4]],2)),\"\")","v":3750},null,"",""]
[null,"3000-5","Septic *",{"$nulls":3},{"$f":"IFERROR(IF(OR(Table162[[#This Row],[Column4]]=\"\",Table162[[#This Row],[Column4]]=0),\"\",ROUND(Table162[[#This Row],[Column4]],2)),\"\")","v":""},null,"",""]
[null,"3000-6","Sewer Lines*",{"$nulls":3},{"$f":"IFERROR(IF(OR(Table162[[#This Row],[Column4]]=\"\",Table162[[#This Row],[Column4]]=0),\"\",ROUND(Table162[[#This Row],[Column4]],2)),\"\")","v":""},null,"",""]
{"$rows_left_out":118}
{"sheet":"Construction Budget","index":2,"n_rows":177,"n_cols":10,"rows_kept":177,"merged":[[2,1,3,3],[6,1,8,2],[7,5,7,8],[9,1,9,2],[10,1,18,2],[10,5,11,5],[20,1,21,1],[20,2,21,3],[24,1,26,5],[26,8,26,9],[176,1,176,5]]}
[]
[]
[null,"Construction Budget Submission Form"]
[]
[]
[null,"Version","4.4"]
[null,"Step 1: Fill out a description of the entire construction project. "]
[{"$nulls":3},{"$f":"\"Status: \"&IF(RF_Status=\"\",\"\",RF_Status)","v":"Status: Initial Budget"}]
[]
[null,"Scope of Work:",null,"Start Date:",null,"Total Budget:"]
[null,"Please provide a description of the whole project.",null,"Estimated Completion Date:",null,{"$f":"IFERROR(SUM(AMT_Totals)-SUM(AMT_CatSubtotals),\"$0 .00 \")","v":{"v":0,"d":"$0.00"}}]
[{"$nulls":3},"Expected Draws:"]
[]
[{"$nulls":4},"Current","Projected"]
[{"$nulls":3},"Total Square Feet:"]
[{"$nulls":3},"Rooms/Units:"]
[{"$nulls":3},"Bedrooms:"]
[{"$nulls":3},"Bathrooms:"]
[{"$nulls":3},"Kitchens:"]
[]
[null,"Property Address:"]
[]
[]
[]
[null,"Step 2: Fill in each line item with the description of the construction cost, the amount, the estimated date of completion, and the draw item name (if necessary)."]
[]
[{"$nulls":8},"Lima One Capital\nBudget Review"]
[null,"Item Number","Category / Draw Item","Description","Amount","Estimated Completion Date",null,null,"Recommended Budget  ","  Comments"]
[]
[null,null,"Soft Costs"]
[null,"Column1","Column2","Column3","Column4","Column5","Column6"]
[null,"1000-2","Temp Gas*",{"$nulls":3},{"$f":"IFERROR(IF(OR(Table16[[#This Row],[Column4]]=\"\",Table16[[#This Row],[Column4]]=0),\"\",ROUND(Table16[[#This Row],[Column4]],2)),\"\")","v":""},null,{"$f":"IF(AMT_Recommend1=\"\",\"\",AMT_Recommend1)","v":""},{"$f":"IF(FR_Comments=\"\",\"\",FR_Comments)","v":""}]
[null,"1000-3","Temp Power*",{"$nulls":3},{"$f":"IFERROR(IF(OR(Table16[[#This Row],[Column4]]=\"\",Table16[[#This Row],[Column4]]=0),\"\",ROUND(Table16[[#This Row],[Column4]],2)),\"\")","v":""},null,"",""]
[null,"1000-4","Temp Toilet",{"$nulls":3},{"$f":"IFERROR(IF(OR(Table16[[#This Row],[Column4]]=\"\",Table16[[#This Row],[Column4]]=0),\"\",ROUND(Table16[[#This Row],[Column4]],2)),\"\")","v":""},null,"",""]
[null,"1000-5","Architecutral Fees",{"$nulls":3},{"$f":"IFERROR(IF(OR(Table16[[#This Row],[Column4]]=\"\",Table16[[#This Row],[Column4]]=0),\"\",ROUND(Table16[[#This Row],[Column4]],2)),\"\")","v":""},null,"",""]
[null,"1000-6","Engineering Fees",{"$nulls":3},{"$f":"IFERROR(IF(OR(Table16[[#This Row],[Column4]]=\"\",Table16[[#This Row],[Column4]]=0),\"\",ROUND(Table16[[#This Row],[Column4]],2)),\"\")","v":""},null,"",""]
[null,"1000-7","Building Permit*",{"$nulls":3},{"$f":"IFERROR(IF(OR(Table16[[#This Row],[Column4]]=\"\",Table16[[#This Row],[Column4]]=0),\"\",ROUND(Table16[[#This Row],[Column4]],2)),\"\")","v":""},null,"",""]
[null,"1000-8","Impact Fees",{"$nulls":3},{"$f":"IFERROR(IF(OR(Table16[[#This Row],[Column4]]=\"\",Table16[[#This Row],[Column4]]=0),\"\",ROUND(Table16[[#This Row],[Column4]],2)),\"\")","v":""},null,"",""]
[null,"1000-9","Survey",{"$nulls":3},{"$f":"IFERROR(IF(OR(Table16[[#This Row],[Column4]]=\"\",Table16[[#This Row],[Column4]]=0),\"\",ROUND(Table16[[#This Row],[Column4]],2)),\"\")","v":""},null,"",""]
[null,"1000-10","Survey/Drawings/Plans*",{"$nulls":3},{"$f":"IFERROR(IF(OR(Table16[[#This Row],[Column4]]=\"\",Table16[[#This Row],[Column4]]=0),\"\",ROUND(Table16[[#This Row],[Column4]],2)),\"\")","v":""},null,"",""]
[null,"1000-11","Erosion Fence",{"$nulls":3},{"$f":"IFERROR(IF(OR(Table16[[#This Row],[Column4]]=\"\",Table16[[#This Row],[Column4]]=0),\"\",ROUND(Table16[[#This Row],[Column4]],2)),\"\")","v":""},null,"",""]
[null,"1000-12","(Enter your line item here)",{"$nulls":3},{"$f":"IFERROR(IF(OR(Table16[[#This Row],[Column4]]=\"\",Table16[[#This Row],[Column4]]=0),\"\",ROUND(Table16[[#This Row],[Column4]],2)),\"\")","v":""},null,"",""]
[null,"1000-13","(Enter your line item here)",{"$nulls":3},{"$f":"IFERROR(IF(OR(Table16[[#This Row],[Column4]]=\"\",Table16[[#This Row],[Column4]]=0),\"\",ROUND(Table16[[#This Row],[Column4]],2)),\"\")","v":""},null,"",""]
[null,null,"Total Soft Costs",null,{"$f":"G44","v":0},null,{"$f":"SUM(G32:G43)","v":0},null,"",""]
[{"$nulls":8},"",""]
[null,null,"Demolition- Trashout",{"$nulls":5},"",""]
[null,"2000-1","Demolition*",{"$nulls":3},{"$f":"IFERROR(IF(OR(Table16[[#This Row],[Column4]]=\"\",Table16[[#This Row],[Column4]]=0),\"\",ROUND(Table16[[#This Row],[Column4]],2)),\"\")","v":""},null,"",""]
[null,"2000-2","Trashout",{"$nulls":3},{"$f":"IFERROR(IF(OR(Table16[[#This Row],[Column4]]=\"\",Table16[[#This Row],[Column4]]=0),\"\",ROUND(Table16[[#This Row],[Column4]],2)),\"\")","v":""},null,"",""]
[null,"2000-3","Dumpster",{"$nulls":3},{"$f":"IFERROR(IF(OR(Table16[[#This Row],[Column4]]=\"\",Table16[[#This Row],[Column4]]=0),\"\",ROUND(Table16[[#This Row],[Column4]],2)),\"\")","v":""},null,"",""]
[null,"2000-4","(Enter your line item here)",{"$nulls":3},{"$f":"IFERROR(IF(OR(Table16[[#This Row],[Column4]]=\"\",Table16[[#This Row],[Column4]]=0),\"\",ROUND(Table16[[#This Row],[Column4]],2)),\"\")","v":""},null,"",""]
[null,"2000-5","(Enter your line item here)",{"$nulls":3},{"$f":"IFERROR(IF(OR(Table16[[#This Row],[Column4]]=\"\",Table16[[#This Row],[Column4]]=0),\"\",ROUND(Table16[[#This Row],[Column4]],2)),\"\")","v":""},null,"",""]
[null,null,"Total Trashout",null,{"$f":"G52","v":0},null,{"$f":"SUM(G47:G51)","v":0},null,"",""]
[{"$nulls":8},"",""]
[null,null,"Site Work",{"$nulls":5},"",""]
[null,"3000-1","Grading*",{"$nulls":3},{"$f":"IFERROR(IF(OR(Table16[[#This Row],[Column4]]=\"\",Table16[[#This Row],[Column4]]=0),\"\",ROUND(Table16[[#This Row],[Column4]],2)),\"\")","v":""},null,"",""]
[null,"3000-2","Underground *",{"$nulls":3},{"$f":"IFERROR(IF(OR(Table16[[#This Row],[Column4]]=\"\",Table16[[#This Row],[Column4]]=0),\"\",ROUND(Table16[[#This Row],[Column4]],2)),\"\")","v":""},null,"",""]
[null,"3000-3","Conduit",{"$nulls":3},{"$f":"IFERROR(IF(OR(Table16[[#This Row],[Column4]]=\"\",Table16[[#This Row],[Column4]]=0),\"\",ROUND(Table16[[#This Row],[Column4]],2)),\"\")","v":""},null,"",""]
[null,"3000-4","Water Lines*",{"$nulls":3},{"$f":"IFERROR(IF(OR(Table16[[#This Row],[Column4]]=\"\",Table16[[#This Row],[Column4]]=0),\"\",ROUND(Table16[[#This Row],[Column4]],2)),\"\")","v":""},null,"",""]
[null,"3000-5","Septic *",{"$nulls":3},{"$f":"IFERROR(IF(OR(Table16[[#This Row],[Column4]]=\"\",Table16[[#This Row],[Column4]]=0),\"\",ROUND(Table16[[#This Row],[Column4]],2)),\"\")","v":""},null,"",""]
[null,"3000-6","Sewer Lines*",{"$nulls":3},{"$f":"IFERROR(IF(OR(Table16[[#This Row],[Column4]]=\"\",Table16[[#This Row],[Column4]]=0),\"\",ROUND(Table16[[#This Row],[Column4]],2)),\"\")","v":""},null,"",""]
{"$rows_left_out":118}
{"sheet":"Budget Review","index":3,"n_rows":182,"n_cols":19,"rows_kept":182,"hidden":true,"merged":[[9,12,10,14],[12,13,12,15],[13,13,13,15],[14,13,14,15],[17,13,17,15],[18,13,18,15],[24,20,26,20],[24,21,26,21],[28,14,29,14],[28,15,29,15],[28,16,29,16],[28,17,29,17],[177,12,177,13]]}
{"$rows_empty":9}
[{"$nulls":12},"Budget Review"]
[]
[]
[{"$nulls":12},"Borrower Name:"]
[{"$nulls":12},"Property Address:",{"$f":"IFERROR('Construction Budget'!C21:D22,\"\")","v":""}]
[]
[{"$nulls":12},"Loan#:"]
[{"$nulls":12},"Date:",null,"Tier:"]
[{"$nulls":12},"Contractor Name:"]
[{"$nulls":12},"Underwriter:"]
[]
[{"$nulls":13},"AREA REVIEWED","APPROVED","NOT APPROVED","EXCEPTION"]
[{"$nulls":13},"Property Description"]
[{"$nulls":13},"Scope of Work"]
[{"$nulls":13},"Cost Breakdown/Bid",{"$nulls":3},"Status:",{"$f":"IF(RF_Status=\"\",\"\",RF_Status)","v":"Initial Budget"}]
[]
[]
[{"$nulls":14},"Original Budget","Recommended","Final Budget","Difference","Comments"]
[{"$nulls":14},{"$f":"SUM(AMT_OrigBudgetCatTotals)","v":{"v":0,"d":"0.00"}},{"$f":"SUM(AMT_RecomBudgetCatTotals1)","v":{"v":0,"d":"0.00"}},{"$f":"SUM(AMT_FinalBudgetCatTotals1)","v":{"v":0,"d":"0.00"}},{"$f":"SUM(AMT_AnalysisCatTotals1)","v":{"v":0,"d":"0.00"}}]
[]
[]
[{"$nulls":12},{"$f":"IF('Construction Budget'!B30=\"\",\"\",'Construction Budget'!B30)","v":""},{"$f":"IF('Construction Budget'!C30=\"\",\"\",'Construction Budget'!C30)","v":"Soft Costs"}]
[{"$nulls":12},{"$f":"IF('Construction Budget'!B32=\"\",\"\",'Construction Budget'!B32)","v":"1000-2"},{"$f":"IF('Construction Budget'!C32=\"\",\"\",'Construction Budget'!C32)","v":"Temp Gas*"},{"$nulls":3},{"$f":"IF(Q32=\"\",\"\",Q32-P32)","v":""}]
[{"$nulls":12},{"$f":"IF('Construction Budget'!B33=\"\",\"\",'Construction Budget'!B33)","v":"1000-3"},{"$f":"IF('Construction Budget'!C33=\"\",\"\",'Construction Budget'!C33)","v":"Temp Power*"},{"$nulls":3},""]
[{"$nulls":12},{"$f":"IF('Construction Budget'!B34=\"\",\"\",'Construction Budget'!B34)","v":"1000-4"},{"$f":"IF('Construction Budget'!C34=\"\",\"\",'Construction Budget'!C34)","v":"Temp Toilet"},{"$nulls":3},""]
[{"$nulls":12},{"$f":"IF('Construction Budget'!B35=\"\",\"\",'Construction Budget'!B35)","v":"1000-5"},{"$f":"IF('Construction Budget'!C35=\"\",\"\",'Construction Budget'!C35)","v":"Architecutral Fees"},{"$nulls":3},""]
[{"$nulls":12},{"$f":"IF('Construction Budget'!B36=\"\",\"\",'Construction Budget'!B36)","v":"1000-6"},{"$f":"IF('Construction Budget'!C36=\"\",\"\",'Construction Budget'!C36)","v":"Engineering Fees"},{"$nulls":3},""]
[{"$nulls":12},{"$f":"IF('Construction Budget'!B37=\"\",\"\",'Construction Budget'!B37)","v":"1000-7"},{"$f":"IF('Construction Budget'!C37=\"\",\"\",'Construction Budget'!C37)","v":"Building Permit*"},{"$nulls":3},""]
[{"$nulls":12},{"$f":"IF('Construction Budget'!B38=\"\",\"\",'Construction Budget'!B38)","v":"1000-8"},{"$f":"IF('Construction Budget'!C38=\"\",\"\",'Construction Budget'!C38)","v":"Impact Fees"},{"$nulls":3},""]
[{"$nulls":12},{"$f":"IF('Construction Budget'!B39=\"\",\"\",'Construction Budget'!B39)","v":"1000-9"},{"$f":"IF('Construction Budget'!C39=\"\",\"\",'Construction Budget'!C39)","v":"Survey"},{"$nulls":3},""]
[{"$nulls":12},{"$f":"IF('Construction Budget'!B40=\"\",\"\",'Construction Budget'!B40)","v":"1000-10"},{"$f":"IF('Construction Budget'!C40=\"\",\"\",'Construction Budget'!C40)","v":"Survey/Drawings/Plans*"},{"$nulls":3},""]
[{"$nulls":12},{"$f":"IF('Construction Budget'!B41=\"\",\"\",'Construction Budget'!B41)","v":"1000-11"},{"$f":"IF('Construction Budget'!C41=\"\",\"\",'Construction Budget'!C41)","v":"Erosion Fence"},{"$nulls":3},""]
[{"$nulls":12},{"$f":"IF('Construction Budget'!B42=\"\",\"\",'Construction Budget'!B42)","v":"1000-12"},{"$f":"IF('Construction Budget'!C42=\"\",\"\",'Construction Budget'!C42)","v":"(Enter your line item here)"},{"$nulls":3},""]
[{"$nulls":12},{"$f":"IF('Construction Budget'!B43=\"\",\"\",'Construction Budget'!B43)","v":"1000-13"},{"$f":"IF('Construction Budget'!C43=\"\",\"\",'Construction Budget'!C43)","v":"(Enter your line item here)"},{"$nulls":3},""]
[{"$nulls":12},{"$f":"IF('Construction Budget'!B44=\"\",\"\",'Construction Budget'!B44)","v":""},{"$f":"IF('Construction Budget'!C44=\"\",\"\",'Construction Budget'!C44)","v":"Total Soft Costs"},{"$nulls":3},{"$f":"SUM(R32:R43)","v":{"v":0,"d":"0.00"}}]
[{"$nulls":12},{"$f":"IF('Construction Budget'!B45=\"\",\"\",'Construction Budget'!B45)","v":""},{"$f":"IF('Construction Budget'!C45=\"\",\"\",'Construction Budget'!C45)","v":""}]
[{"$nulls":12},{"$f":"IF('Construction Budget'!B46=\"\",\"\",'Construction Budget'!B46)","v":""},{"$f":"IF('Construction Budget'!C46=\"\",\"\",'Construction Budget'!C46)","v":"Demolition- Trashout"},{"$nulls":3},""]
[{"$nulls":12},{"$f":"IF('Construction Budget'!B47=\"\",\"\",'Construction Budget'!B47)","v":"2000-1"},{"$f":"IF('Construction Budget'!C47=\"\",\"\",'Construction Budget'!C47)","v":"Demolition*"},{"$nulls":3},""]
[{"$nulls":12},{"$f":"IF('Construction Budget'!B48=\"\",\"\",'Construction Budget'!B48)","v":"2000-2"},{"$f":"IF('Construction Budget'!C48=\"\",\"\",'Construction Budget'!C48)","v":"Trashout"},{"$nulls":3},""]
[{"$nulls":12},{"$f":"IF('Construction Budget'!B49=\"\",\"\",'Construction Budget'!B49)","v":"2000-3"},{"$f":"IF('Construction Budget'!C49=\"\",\"\",'Construction Budget'!C49)","v":"Dumpster"},{"$nulls":3},""]
[{"$nulls":12},{"$f":"IF('Construction Budget'!B50=\"\",\"\",'Construction Budget'!B50)","v":"2000-4"},{"$f":"IF('Construction Budget'!C50=\"\",\"\",'Construction Budget'!C50)","v":"(Enter your line item here)"},{"$nulls":3},""]
[{"$nulls":12},{"$f":"IF('Construction Budget'!B51=\"\",\"\",'Construction Budget'!B51)","v":"2000-5"},{"$f":"IF('Construction Budget'!C51=\"\",\"\",'Construction Budget'!C51)","v":"(Enter your line item here)"},{"$nulls":3},""]
[{"$nulls":12},{"$f":"IF('Construction Budget'!B52=\"\",\"\",'Construction Budget'!B52)","v":""},{"$f":"IF('Construction Budget'!C52=\"\",\"\",'Construction Budget'!C52)","v":"Total Trashout"},{"$nulls":3},{"$f":"SUM(R47:R51)","v":{"v":0,"d":"0.00"}}]
[{"$nulls":12},{"$f":"IF('Construction Budget'!B53=\"\",\"\",'Construction Budget'!B53)","v":""},{"$f":"IF('Construction Budget'!C53=\"\",\"\",'Construction Budget'!C53)","v":""}]
[{"$nulls":12},{"$f":"IF('Construction Budget'!B54=\"\",\"\",'Construction Budget'!B54)","v":""},{"$f":"IF('Construction Budget'!C54=\"\",\"\",'Construction Budget'!C54)","v":"Site Work"},{"$nulls":3},""]
[{"$nulls":12},{"$f":"IF('Construction Budget'!B55=\"\",\"\",'Construction Budget'!B55)","v":"3000-1"},{"$f":"IF('Construction Budget'!C55=\"\",\"\",'Construction Budget'!C55)","v":"Grading*"},{"$nulls":3},""]
[{"$nulls":12},{"$f":"IF('Construction Budget'!B56=\"\",\"\",'Construction Budget'!B56)","v":"3000-2"},{"$f":"IF('Construction Budget'!C56=\"\",\"\",'Construction Budget'!C56)","v":"Underground *"},{"$nulls":3},""]
[{"$nulls":12},{"$f":"IF('Construction Budget'!B57=\"\",\"\",'Construction Budget'!B57)","v":"3000-3"},{"$f":"IF('Construction Budget'!C57=\"\",\"\",'Construction Budget'!C57)","v":"Conduit"},{"$nulls":3},""]
[{"$nulls":12},{"$f":"IF('Construction Budget'!B58=\"\",\"\",'Construction Budget'!B58)","v":"3000-4"},{"$f":"IF('Construction Budget'!C58=\"\",\"\",'Construction Budget'!C58)","v":"Water Lines*"},{"$nulls":3},""]
[{"$nulls":12},{"$f":"IF('Construction Budget'!B59=\"\",\"\",'Construction Budget'!B59)","v":"3000-5"},{"$f":"IF('Construction Budget'!C59=\"\",\"\",'Construction Budget'!C59)","v":"Septic *"},{"$nulls":3},""]
[{"$nulls":12},{"$f":"IF('Construction Budget'!B60=\"\",\"\",'Construction Budget'!B60)","v":"3000-6"},{"$f":"IF('Construction Budget'!C60=\"\",\"\",'Construction Budget'!C60)","v":"Sewer Lines*"},{"$nulls":3},""]
[{"$nulls":12},{"$f":"IF('Construction Budget'!B61=\"\",\"\",'Construction Budget'!B61)","v":"3000-7"},{"$f":"IF('Construction Budget'!C61=\"\",\"\",'Construction Budget'!C61)","v":"Landscape"},{"$nulls":3},""]
[{"$nulls":12},{"$f":"IF('Construction Budget'!B62=\"\",\"\",'Construction Budget'!B62)","v":"3000-8"},{"$f":"IF('Construction Budget'!C62=\"\",\"\",'Construction Budget'!C62)","v":"Fence"},{"$nulls":3},""]
[{"$nulls":12},{"$f":"IF('Construction Budget'!B63=\"\",\"\",'Construction Budget'!B63)","v":"3000-9"},{"$f":"IF('Construction Budget'!C63=\"\",\"\",'Construction Budget'!C63)","v":"Concrete"},{"$nulls":3},""]
[{"$nulls":12},{"$f":"IF('Construction Budget'!B64=\"\",\"\",'Construction Budget'!B64)","v":"3000-10"},{"$f":"IF('Construction Budget'!C64=\"\",\"\",'Construction Budget'!C64)","v":"Asphalt"},{"$nulls":3},""]
[{"$nulls":12},{"$f":"IF('Construction Budget'!B65=\"\",\"\",'Construction Budget'!B65)","v":"3000-11"},{"$f":"IF('Construction Budget'!C65=\"\",\"\",'Construction Budget'!C65)","v":"Hardscape"},{"$nulls":3},""]
[{"$nulls":12},{"$f":"IF('Construction Budget'!B66=\"\",\"\",'Construction Budget'!B66)","v":"3000-12"},{"$f":"IF('Construction Budget'!C66=\"\",\"\",'Construction Budget'!C66)","v":"Softscape"},{"$nulls":3},""]
[{"$nulls":12},{"$f":"IF('Construction Budget'!B67=\"\",\"\",'Construction Budget'!B67)","v":"3000-13"},{"$f":"IF('Construction Budget'!C67=\"\",\"\",'Construction Budget'!C67)","v":"Pool/Spa"},{"$nulls":3},""]
[{"$nulls":12},{"$f":"IF('Construction Budget'!B68=\"\",\"\",'Construction Budget'!B68)","v":"3000-14"},{"$f":"IF('Construction Budget'!C68=\"\",\"\",'Construction Budget'!C68)","v":"(Enter your line item here)"},{"$nulls":3},""]
{"$rows_left_out":115}
{"sheet":"Reference","index":4,"n_rows":13,"n_cols":7,"rows_kept":13,"hidden":true}
[]
[{"$nulls":5},"Approvals:"]
[{"$nulls":5},1,false]
[{"$nulls":5},2,false]
[{"$nulls":5},3,false]
[{"$nulls":5},4,true]
[]
[{"$nulls":5},"RF_CountApprovals",{"$f":"COUNTIF(G3:G6,TRUE)","v":1}]
[]
[{"$nulls":5},"RF_Status","Initial Budget"]
[]
[{"$nulls":5},"RF_Analyst"]
[{"$nulls":5},"RF_Date_Approved"]